
Zewei Yang
authored
=========================== short test summary info ============================
FAILED tests/test_application.py::test_download_journal - UnboundLocalError: ...
FAILED tests/test_core_filters.py::test_time_filter - UnboundLocalError: cann...
FAILED tests/test_json_api.py::test_api[income_statement-/long-example/api/income_statement?time=2014]
FAILED tests/test_json_api.py::test_api[trial_balance-/long-example/api/trial_balance?time=2014]
=================== 4 failed, 333 passed, 1 skipped in 9.94s ===================
Signed-off-by:
yzewei <yangzewei@loongson.cn>
Name | Last commit | Last update |
---|