• Leonardo Arena's avatar
    main/dovecot: disable tests on 32bit arches · c85c9452
    Leonardo Arena authored
    test-event-stats.c:365: Assert failed: compare_test_stats_to( "EVENT	%lu	1	0	0" "	stest-event-stats.c	%d" "	l0	0	ctest2\n", id, l)
    no merging parent sent to stats ...................................... : FAILED
    test-event-stats.c:394: Assert failed: compare_test_stats_to( "BEGIN	%lu	0	1	0	0" "	stest-event-stats.c	%d	ctest1\n" "EVENT	%lu	1	1	0" "	stest-event-stats.c	%d" "	l1	0	ctest2\n" "END\t%lu\n", idp, lp, idp, l, idp)
    no merging parent timestamp differs .................................. : FAILED
    merge events parent NULL ............................................. : ok
    test-event-stats.c:458: Assert failed: compare_test_stats_to( "EVENT	%lu	1	0	0" "	stest-event-stats.c	%d	l0	0" "	ctest3	ctest2	ctest1	Tkey3" "	10	0	Ikey2	20" "	Skey1	str1\n", id, l)
    merge events parent sent to stats .................................... : FAILED
    test-event-stats.c:490: Assert failed: compare_test_stats_to( "BEGIN	%lu	0	1	0	0" "	stest-event-stats.c	%d	ctest1\n" "EVENT	%lu	1	3	0	" "stest-event-stats.c	%d	l3	0" "	ctest2\nEND\t%lu\n", id, lp, id, l, id)
    skip empty parents ................................................... : FAILED
    test-event-stats.c:533: Assert failed: compare_test_stats_to( "BEGIN	%lu	0	1	0	0" "	stest-event-stats.c	%d	ctest1\n" "EVENT	%lu	1	3	0	" "stest-event-stats.c	%d	l3	0	" "ctest4	ctest5	Tkey3	10	0	Skey4" "	str4\nEND\t%lu\n", id, lp, id, l, id)
    merge events and skip empty parents .................................. : FAILED
    5 / 7 tests failed
    c85c9452
APKBUILD 7.77 KB